Loading

wait a moment

Syntax Error On Token ;, , Expected

Westminster College Academic Calendar 2019-2019 Change Management Position Paper On A Large Organization Gone Through Significant Change their teams through a current change. Participants work with peers and CCL experts, are immersed in a change simulation activity, learn their personal preference for change, and plan how to apply—and sustain— what they learn. CCL works with organizations to help them navigate
Linguistics Courses Online Free Find out what you could study in an online linguistics course, either at the undergraduate or graduate level. Learn about the degree levels. An introduction to linguistics, the scientific study of language. Toggle navigation ielanguages.com – Learn languages online for free. French. French Tutorials. Prospective students who searched for List of Free Online Logistics Courses

I suggest that the parser, when reporting a syntax error, should make use of its knowlegde of which token type is expected at the position where.

Now I have these errors: Error 2 error C2143: syntax error : missing. unexpected token(s) preceding ‘;’ c:program filesmicrosoft sdkswindowsv7.0aincludewinnt.h 13112 9 IntelliSense: expected.

lab2.c:20: error: expected â;â before âdateCodeâ lab2.c:21: error: expected â;â before âdataTypeâ lab2.c:25: error: expected â;â before âstrâ lab2.c:26: error: expected expression before â:â token.

here is what i have done yet: spammer2.cpp:5: error: `ofstream’ undeclared (first use this function) spammer2.cpp:5: error: (Each undeclared identifier is reported only once for each function it.

Jul 7, 2017. If you're seeing a SyntaxError: Unexpected token < in JSON at position 0 error in your browser console at angular.js:13920 , or Line 13920 or.

This is the actual problem: mPlayer = new MediaPlayer();. That's just a statement – but it's not in a constructor, method or other initializer. It's not.

I this post, I want to focus on 6 things to start with, if you haven’t yet started writing. Needs a value assignment at the time of declaration else it will throw a syntax error “Unexpected token”.

I test those because it enables me to work a lot faster than if I had to build the app, install it and then visually verify (try to) that the algorithm had performed as expected. object which.

Kenny Kerr continues his series about compiler fundamentals by introducing the syntax analysis, grammars. value that may be retrieved when the Scanner’s Read method returns the Token::Number.

error: expected `)’ before ‘&’ token main.cpp:122: error: expected `{‘ before ‘&’ token main.cpp:122: error: ‘e’ was not declared in this scope main.cpp:122: error: expected `;’ before ‘)’ token.

Getting advice that I have a syntax error in my Javascript should tell me exactly where it. Error (index_hype_generated_script.js, line 5) column: 13497 line: 5 message: "Unexpected token '.'. Expected a property name after '.

It is a behavioral design pattern that aims to parse any expression according to grammar rules, build abstract syntax tree and then run the interpretation to return the expected result. If the.

how about the validity of the provided token through instantiation. test now produces a new error: Whoa! We broke PHPUnit! Just kidding, we’re good. It’s complaining about not having a setTimeout().

[eclipse]Syntax error on token ";",{ expected after this token. 2012年02月08日09: 23:39 攻城无数 阅读数111818. 版权声明:本文为博主原创文章,未经博主允许不得.

The rest are showing EC2 instance (BOTO3), parsing, pattern matching, firing up messages back to slack (appending BOT_TOKEN env. finally works as expected. Ok we can see an instance is stopped, let.

Apr 9, 2018. May be try like this. FOR each File in filelist ('$(vSPOPAdPromo)*.CSV'). Folder: LOAD. '$(File)' as Name, FileTime( '$(File)' ) as FileTime.

I am in a little, and i get 2 errors that say "Syntax error on token "(" expected" and " Syntax error on token ")" expected". The errors happen on line.

The hoc7 executable could, of course, be placed in your local bin directory, for example, and your shell path set so that the command hoc7 testplay would work as expected. Error Back in the batch.

Mar 10, 2017. The Unexpected Token error is a specific type of SyntaxError object. of how JavaScript parsers work, and therefore what syntax is expected.

With the imminent release of Angular2, it might be a good time to re-evaluate the use of the MVC pattern and therefore the value MVC Frameworks bring to Application. functions and the JSX syntax:.

it "conforms to schema" do get :show, id: account.id assert_schema_conform end end 1) AccountsController GET #show when the token is valid conforms to schema Failure/Error: assert_schema. curl.

Queer Theory Is A Growing Body Of Knowledge Asserting That: Nov 30, 2015  · Today there is a growing community of human pups and handlers who gather to socialize and play at events all over the United States and Europe. While the majority of the puppy play community is gay men, people of any gender and sexual orientation can be involved in the subculture. researchers and

I was able to fix the error using syntax from other functions I've used in the past: let intExtraction = (AlphaNumeric as any, optional StringLimit as number) => let.

ERROR VCP2000 "Syntax error. Unexpected token: library[_IDENTIFIER]. Expected tokens: 'function' , 'task' , 'timeprecision' , 'timeunit' , 'const'." Description.

Extended Slice Syntax Python if var1 == "image0.GIF" or "image1.GIF" or "image2.GIF": Right. Notice the subtle difference and be careful about it: the original code is legitimate Python, but it doesn’t mean what one might think it means. Right. Notice the subtle difference and be careful about it: the original code is. Road Scholar With Grandparents To China –

We all know that unit tests help us to be sure that code works as we expected. And one of the metrics we can use. In this case, tests caught the error and detected that something was wrong in the.

ISO C++ forbids initialization of member. the same error for each part, one error on each of the first three lines in the if statement, 2 on each of the three lines in the else statement. error:.

The Gitlab pipeline is started by using a Gitlab trigger deploy token. The deploy token can be created. The real challenge is handling JSON attributes that are expected in array syntax [".", ".

Critical Analysis Systematic Review Queer Theory Is A Growing Body Of Knowledge Asserting That: Nov 30, 2015  · Today there is a growing community of human pups and handlers who gather to socialize and play at events all over the United States and Europe. While the majority of the puppy play community is gay men, people of any gender and

Aug 17, 2011. Re: syntax error on token "(", expression expected after this token. I'd stay away from using Time as a variable name. It's a class in java.sql. Also.

Hello. Please help with this code. Returns an error message "syntax error near unexpected token =~. Conditional binary operator expected. pre.

c:program filesmicrosoft visual studiomyprojectslatestvoorbeeldenboekvervolgvkv.h(1) : error C2143: syntax error : missing ‘;’ before ‘–‘ c:program filesmicrosoft visual.

Masonic Entered Apprentice Degree Lecture A Blue Lodge is a lodge of Freemasons that confers the first three degrees: 1º — Entered Apprentice. 2º — Fellow Craft. 3º — Master Mason. You can join other. Critical Analysis Systematic Review Queer Theory Is A Growing Body Of Knowledge Asserting That: Nov 30, 2015  · Today there is a growing community of human

How do I prevent the "unexpected token" (Syntax Error -JQuery)?. bracket in lieu of the expected for-loop parentheses: Unexpected token [.

Syntax error on token "import", delete this token. Generated servlet. Syntax error on tokens, SimpleName expected instead. An error occurred.

May 28, 2017. please attach screenshots – what are You do and error message (where You have it, in which form) and etc. it seriously increase chances to.

Jul 31, 2007. Hi, I can't seem to figure out a syntax error. Here is some stuff for background. I am using Eclipse 3.0.1 IDE and I downloaded Java 5 Update 1.

The reason you get a syntax error in that code is that you have an extra bracket. Try the following code: 1. package org.temp2.cod1;; 2. import.